BDBM434777 US10562910, Example 4
SMILES OC(=O)c1cc(F)c2CCc3nc(OCc4c(onc4-c4c(Cl)cccc4Cl)C4CC4)ccc3Oc2c1
InChI Key InChIKey=ACQLAZWSLWBDRC-UHFFFAOYSA-N
Data  2 EC50
  Tab Delimited (TSV)   2D SDfile   Computed 3D by Vconf -m prep SDfile
Find this compound or compounds like it in BindingDB:
Activity Spreadsheet -- Enzyme Inhibition Constant Data from BindingDB
Found 2 hits for monomerid = 434777
TargetBile acid receptor(Homo sapiens (Human))
Southern Medical University Biomedical Research Center
Curated by ChEMBL
LigandPNGBDBM434777(US10562910, Example 4)
Affinity DataEC50:  372nM. Assay description: Agonist activity at human FXR expressed in HEK293T cells by luciferase reporter assay
Ligand InfoPC cidPC sid
In DepthDetails PubMed
TargetBile acid receptor(Homo sapiens (Human))
Southern Medical University Biomedical Research Center
Curated by ChEMBL
LigandPNGBDBM434777(US10562910, Example 4)
Affinity DataEC50:  60.4nM. Assay description: Purchasing invitrogen PV4833 kits. The procedure refers to LanthaScreen TR-FRET Farnesoid X Receptor Coactivator AssayFirst, the required amount of t...
Ligand InfoPC cidPC sid
In DepthDetails US Patent