BDBM434839 US10577368, Compound 123
SMILES CCNc1nc(N=[N+]=[N-])nc2n(cnc12)[C@@H]1C2C[C@@]2(C(O)[C@H]1O)C(=O)NC
InChI Key InChIKey=PTUDMJSZIVMQLL-DLVSGEEMSA-N
Data  2 KI
  Tab Delimited (TSV)   2D SDfile   Computed 3D by Vconf -m prep SDfile
Find this compound or compounds like it in BindingDB:
Activity Spreadsheet -- Enzyme Inhibition Constant Data from BindingDB
Found 2 hits for monomerid = 434839
TargetAdenosine receptor A3(Homo sapiens (Human))
The United States Of America, As Represented By The Secretary, Department Of Health And Human Services
US Patent
LigandPNGBDBM434839(US10577368, Compound 123)
Affinity DataKi:  0.600nM. Assay description: [3H]R—N6-Phenylisopropyladenosine (40, [3H]R-PIA, 63 Ci/mmol), [3H](2-[p-(2-carboxyethyl)phenyl-ethylamino]-5′-N-ethylcarboxamido-adenosine) (4...
Ligand InfoPC cidPC sid
In DepthDetails US Patent
TargetAdenosine receptor A1(Homo sapiens (Human))
The United States Of America, As Represented By The Secretary, Department Of Health And Human Services
US Patent
LigandPNGBDBM434839(US10577368, Compound 123)
Affinity DataKi:  707nM. Assay description: [3H]R—N6-Phenylisopropyladenosine (40, [3H]R-PIA, 63 Ci/mmol), [3H](2-[p-(2-carboxyethyl)phenyl-ethylamino]-5′-N-ethylcarboxamido-adenosine) (4...
Ligand InfoPC cidPC sid
In DepthDetails US Patent