BDBM434840 US10577368, Compound 124
SMILES CNC(=O)[C@]12CC1[C@H]([C@H](O)C2O)n1cnc2c(NCc3cccc(Cl)c3)nc(N=[N+]=[N-])nc12
InChI Key InChIKey=ITEAZQCBBBPLEJ-BVOXGMNSSA-N
Data  1 KI
  Tab Delimited (TSV)   2D SDfile   Computed 3D by Vconf -m prep SDfile
Find this compound or compounds like it in BindingDB:
Activity Spreadsheet -- Enzyme Inhibition Constant Data from BindingDB
Found 1 hit for monomerid = 434840
TargetAdenosine receptor A3(Homo sapiens (Human))
The United States Of America, As Represented By The Secretary, Department Of Health And Human Services
US Patent
LigandPNGBDBM434840(US10577368, Compound 124)
Affinity DataKi:  1.08nM. Assay description: [3H]R—N6-Phenylisopropyladenosine (40, [3H]R-PIA, 63 Ci/mmol), [3H](2-[p-(2-carboxyethyl)phenyl-ethylamino]-5′-N-ethylcarboxamido-adenosine) (4...
Ligand InfoPC cidPC sid
In DepthDetails US Patent