BDBM434853 US10577383, Example 11::[(11S)-7-{5-Amino-3H-[1,2,3]triazolo[4,5-b]pyridin-7-yl}-18-oxa-3,4,10-triazatetracyclo[17.3.1.13,6.113,17]pentacosa-1(23),4,6(25),13,15,17
SMILES Nc1cc(C2CCN[C@H](CO)Cc3cccc(Oc4cccc(Cn5cc2cn5)c4)c3)c2nn[nH]c2n1
InChI Key
Data  2 IC50
  Tab Delimited (TSV)   2D SDfile   Computed 3D by Vconf -m prep SDfile
Find this compound or compounds like it in BindingDB:
Activity Spreadsheet -- Enzyme Inhibition Constant Data from BindingDB
Found 2 hits for monomerid = 434853
TargetMyeloperoxidase(Homo sapiens (Human))
Bristol-Myers Squibb
US Patent
LigandPNGBDBM434853(US10577383, Example 11 | [(11S)-7-{5-Amino-3H-[1,2...)
Affinity DataIC50:  50nM. Assay description: MPO chlorination activity was measured in 100 mM KPi (pH 7.4) by utilizing the non-fluorescent reagent Aminophenyl fluorescein (APF, Invitrogen Cat. ...
Ligand InfoPC cidPC sid
In DepthDetails US Patent
TargetMyeloperoxidase(Homo sapiens (Human))
Bristol-Myers Squibb
US Patent
LigandPNGBDBM434853(US10577383, Example 11 | [(11S)-7-{5-Amino-3H-[1,2...)
Affinity DataIC50:  550nM. Assay description: MPO peroxidation activity was measured in 100 mM KPi (pH 7.4) by utilizing the non-fluorescent reagent Amplex Red (Invitrogen Cat. #A12222) which can...
Ligand InfoPC cidPC sid
In DepthDetails US Patent