BDBM435029 (2S)-1-(benzofuran-2-ylsulfonyl)-N-[[2,4-dioxo-3- tetrahydropyran-4-yl-1-[4-(trifluoromethyl)phenyl]- pyrimidin-5-yl]methyl]pyrrolidine-2-carboxamide::US10584116, Example 9
SMILES FC(F)(F)c1ccc(cc1)-n1cc(CNC(=O)[C@@H]2CCCN2S(=O)(=O)c2cc3ccccc3o2)c(=O)n(C2CCOCC2)c1=O
InChI Key InChIKey=UHFTVWYXWVHSRU-DEOSSOPVSA-N
Data  1 IC50
  Tab Delimited (TSV)   2D SDfile   Computed 3D by Vconf -m prep SDfile
Find this compound or compounds like it in BindingDB:
Activity Spreadsheet -- Enzyme Inhibition Constant Data from BindingDB
Found 1 hit for monomerid = 435029
TargetTransient receptor potential cation channel subfamily A member 1(Homo sapiens (Human))
Ea Pharma
US Patent
LigandPNGBDBM435029((2S)-1-(benzofuran-2-ylsulfonyl)-N-[[2,4-dioxo-3- ...)
Affinity DataIC50:  140nM. Assay description: Human TRPA1 Expression PlasmidUsing cDNA encoding human TRPA1 (GenBank accession No. NM_007332) (manufactured by Kazusa DNA Research Institute, item ...
Ligand InfoPC cidPC sid
In DepthDetails US Patent