BDBM435095 US10584120, Compound 26
SMILES Fc1cc(ccc1C1CNC(=O)N1c1ccc2[nH]cnc2c1)-c1csc(c1)C(F)(F)F
InChI Key
Data  1 KI
  Tab Delimited (TSV)   2D SDfile   Computed 3D by Vconf -m prep SDfile
Find this compound or compounds like it in BindingDB:
Activity Spreadsheet -- Enzyme Inhibition Constant Data from BindingDB
Found 1 hit for monomerid = 435095
TargetGlutaminyl-peptide cyclotransferase(Homo sapiens (Human))
National Health Research Institutes
US Patent
LigandPNGBDBM435095(US10584120, Compound 26)
Affinity DataKi:  114nM. Assay description: An inhibition activity assay of QC inhibitors was conducted. See Huang et al., J. Biol. Chem. 2011, 286, 12439-12449. A reaction mixture containing 3...
Ligand InfoPC cidPC sid
In DepthDetails US Patent