BDBM435143 US10584134, Example 1-2
SMILES CC1(C)CC(=O)C2=C(C1)N1CCc3ccccc3C1CC21SCCS1
InChI Key InChIKey=QTVLAXQYDPELMB-UHFFFAOYSA-N
Data  1 EC50
  Tab Delimited (TSV)   2D SDfile   Computed 3D by Vconf -m prep SDfile
Find this compound or compounds like it in BindingDB:
Activity Spreadsheet -- Enzyme Inhibition Constant Data from BindingDB
Found 1 hit for monomerid = 435143
TargetTransient receptor potential cation channel subfamily M member 8(Homo sapiens (Human))
Symrise
US Patent
LigandPNGBDBM435143(US10584134, Example 1-2)
Affinity DataEC50:  600nM. Assay description: A test comparable with that previously described in the literature by Behrendt H. J. et al., Br. J. Pharmacol. 141, 2004, 737-745, is carried out. Th...
In DepthDetails US Patent