BDBM435177 US10584134, Example 3-2
SMILES O=C(\C=C\c1ccc2OCOc2c1)N(C1CCCCC1)C1CCCCC1
InChI Key InChIKey=NSZJUUKNNAYKBF-WYMLVPIESA-N
Data  1 EC50
  Tab Delimited (TSV)   2D SDfile   Computed 3D by Vconf -m prep SDfile
Find this compound or compounds like it in BindingDB:
Activity Spreadsheet -- Enzyme Inhibition Constant Data from BindingDB
Found 1 hit for monomerid = 435177
TargetTransient receptor potential cation channel subfamily M member 8(Homo sapiens (Human))
Symrise
US Patent
LigandPNGBDBM435177(US10584134, Example 3-2)
Affinity DataEC50:  1.18E+4nM. Assay description: A test comparable with that previously described in the literature by Behrendt H. J. et al., Br. J. Pharmacol. 141, 2004, 737-745, is carried out. Th...
In DepthDetails US Patent