BDBM43522 2-[3-(4-fluorophenyl)-2,4-diketo-thieno[3,2-d]pyrimidin-1-yl]-N-homoveratryl-acetamide::MLS000730324::N-[2-(3,4-dimethoxyphenyl)ethyl]-2-[3-(4-fluorophenyl)-2,4-bis(oxidanylidene)thieno[3,2-d]pyrimidin-1-yl]ethanamide::N-[2-(3,4-dimethoxyphenyl)ethyl]-2-[3-(4-fluorophenyl)-2,4-dioxo-1-thieno[3,2-d]pyrimidinyl]acetamide::N-[2-(3,4-dimethoxyphenyl)ethyl]-2-[3-(4-fluorophenyl)-2,4-dioxo-3,4-dihydrothieno[3,2-d]pyrimidin-1(2H)-yl]acetamide::N-[2-(3,4-dimethoxyphenyl)ethyl]-2-[3-(4-fluorophenyl)-2,4-dioxothieno[3,2-d]pyrimidin-1-yl]acetamide::SMR000308600::cid_16187877
SMILES COc1ccc(CCNC(=O)Cn2c3ccsc3c(=O)n(-c3ccc(F)cc3)c2=O)cc1OC
InChI Key InChIKey=OIQDCULIPTUVMZ-UHFFFAOYSA-N
Data  2 IC50
  Tab Delimited (TSV)   2D SDfile   Computed 3D by Vconf -m prep SDfile
Find this compound or compounds like it in BindingDB:
Activity Spreadsheet -- Enzyme Inhibition Constant Data from BindingDB
Found 2 hits for monomerid = 43522
TargetSignal transducer and activator of transcription 1-alpha/beta(Homo sapiens (Human))
The Scripps Research Institute Molecular Screening Center
Curated by PubChem BioAssay
LigandPNGBDBM43522(2-[3-(4-fluorophenyl)-2,4-diketo-thieno[3,2-d]pyri...)
Affinity DataIC50:  1.41E+4nM. Assay description: Source (MLPCN Center Name): The Scripps Research Institute Molecular Screening Center Center Affiliation: The Scripps Research Institute (TSRI) Assay...
In DepthDetails PCBioAssay
TargetSignal transducer and activator of transcription 3 [702-738,740-752](Homo sapiens (Human))
The Scripps Research Institute Molecular Screening Center
Curated by PubChem BioAssay
LigandPNGBDBM43522(2-[3-(4-fluorophenyl)-2,4-diketo-thieno[3,2-d]pyri...)
Affinity DataIC50: >5.57E+4nM. Assay description: Source (MLPCN Center Name): The Scripps Research Institute Molecular Screening Center Center Affiliation: The Scripps Research Institute (TSRI) Assay...
In DepthDetails PCBioAssay