BDBM435220 US10584134, Example 3-42
SMILES COc1ccc(CCC(=O)N(C2CCCCC2)c2ccccn2)cc1
InChI Key InChIKey=LWDZAHDMLGNGKO-UHFFFAOYSA-N
Data  1 EC50
  Tab Delimited (TSV)   2D SDfile   Computed 3D by Vconf -m prep SDfile
Find this compound or compounds like it in BindingDB:
Activity Spreadsheet -- Enzyme Inhibition Constant Data from BindingDB
Found 1 hit for monomerid = 435220
TargetTransient receptor potential cation channel subfamily M member 8(Homo sapiens (Human))
Symrise
US Patent
LigandPNGBDBM435220(US10584134, Example 3-42)
Affinity DataEC50:  3.30E+3nM. Assay description: A test comparable with that previously described in the literature by Behrendt H. J. et al., Br. J. Pharmacol. 141, 2004, 737-745, is carried out. Th...
Ligand InfoPC cidPC sid
In DepthDetails US Patent