BDBM435248 N-(tert-butyl)-5-(3-methoxyphenyl)-8- ((2-(pyridin-3-yl) cyclopropanecarboxamido)methyl)- 3,4-dihydroisoquinoline-2(1H)- carboxamide (mixture of 4 isomers)::US10568876, Example 13
SMILES COc1cccc(c1)-c1ccc(CNC(=O)C2CC2c2cccnc2)c2CN(CCc12)C(=O)NC(C)(C)C
InChI Key InChIKey=YOMCVFACVVFCTR-UHFFFAOYSA-N
Data  1 IC50
  Tab Delimited (TSV)   2D SDfile   Computed 3D by Vconf -m prep SDfile
Find this compound or compounds like it in BindingDB:
Activity Spreadsheet -- Enzyme Inhibition Constant Data from BindingDB
Found 1 hit for monomerid = 435248
TargetDiacylglycerol O-acyltransferase 2(Homo sapiens (Human))
Merck Sharp & Dohme
US Patent
LigandPNGBDBM435248(N-(tert-butyl)-5-(3-methoxyphenyl)-8- ((2-(pyridin...)
Affinity DataIC50:  6.10nM. Assay description: DGAT2 activity was determined by measuring the amount of enzymatic product triolein (1,2,3-Tri(cis-9-octadecenoyl)glycerol) using the membrane prep m...
Ligand InfoPC cidPC sid
In DepthDetails US Patent