BDBM435322 (trans)-2-(((2-(tert-butylcarbamoyl)-5-(3- methoxyphenyl)-1,2,3,4- tetrahydroisoquinolin-8-yl)methyl) carbamoyl)cyclopropanecarboxylic acid (mixture of 2 isomers)::US10568876, Example 84
SMILES COc1cccc(c1)-c1ccc(CNC(=O)[C@H]2C[C@@H]2C(O)=O)c2CN(CCc12)C(=O)NC(C)(C)C
InChI Key InChIKey=BVFQKEMRBSUGAW-VXKWHMMOSA-N
Data  1 IC50
  Tab Delimited (TSV)   2D SDfile   Computed 3D by Vconf -m prep SDfile
Find this compound or compounds like it in BindingDB:
Activity Spreadsheet -- Enzyme Inhibition Constant Data from BindingDB
Found 1 hit for monomerid = 435322
TargetDiacylglycerol O-acyltransferase 2(Homo sapiens (Human))
Merck Sharp & Dohme
US Patent
LigandPNGBDBM435322((trans)-2-(((2-(tert-butylcarbamoyl)-5-(3- methoxy...)
Affinity DataIC50:  1.34E+3nM. Assay description: DGAT2 activity was determined by measuring the amount of enzymatic product triolein (1,2,3-Tri(cis-9-octadecenoyl)glycerol) using the membrane prep m...
Ligand InfoPC cidPC sid
In DepthDetails US Patent