BDBM435342 (trans)-N-((2-(2-(4,4-dimethyloxazolidin- 3-yl)-2-oxoethyl)-5-(3- (trifluoromethoxy)phenyl)-1,2,3,4- tetrahydroisoquinolin-8-yl)methyl)-2-(3- methyl-1,2,4-oxadiazol-5- yl)cyclopropanecarboxamide (mixture of 2 isomers)::US10568876, Example 103
SMILES Cc1noc(n1)[C@@H]1CC1C(=O)NCc1ccc(-c2cccc(OC(F)(F)F)c2)c2CCN(CC(=O)N3COCC3(C)C)Cc12
InChI Key InChIKey=PVKOYWGJWCGPED-WUBHUQEYSA-N
Data  1 IC50
  Tab Delimited (TSV)   2D SDfile   Computed 3D by Vconf -m prep SDfile
Find this compound or compounds like it in BindingDB:
Activity Spreadsheet -- Enzyme Inhibition Constant Data from BindingDB
Found 1 hit for monomerid = 435342
TargetDiacylglycerol O-acyltransferase 2(Homo sapiens (Human))
Merck Sharp & Dohme
US Patent
LigandPNGBDBM435342((trans)-N-((2-(2-(4,4-dimethyloxazolidin- 3-yl)-2-...)
Affinity DataIC50:  1.76E+3nM. Assay description: DGAT2 activity was determined by measuring the amount of enzymatic product triolein (1,2,3-Tri(cis-9-octadecenoyl)glycerol) using the membrane prep m...
Ligand InfoPC cidPC sid
In DepthDetails US Patent