BDBM435351 US10568876, Example 112::methyl 3-(2-(2-phenylacetyl)-8-((2- phenylcyclopropanecarboxamido)methyl)- 1,2,3,4-tetrahydroisoquinolin-5- yl)benzoate (mixture of 4 isomers)
SMILES COC(=O)c1cccc(c1)-c1ccc(CNC(=O)C2CC2c2ccccc2)c2CN(CCc12)C(=O)Cc1ccccc1
InChI Key InChIKey=NSQOAJLBEOBOCB-UHFFFAOYSA-N
Data  1 IC50
  Tab Delimited (TSV)   2D SDfile   Computed 3D by Vconf -m prep SDfile
Find this compound or compounds like it in BindingDB:
Activity Spreadsheet -- Enzyme Inhibition Constant Data from BindingDB
Found 1 hit for monomerid = 435351
TargetDiacylglycerol O-acyltransferase 2(Homo sapiens (Human))
Merck Sharp & Dohme
US Patent
LigandPNGBDBM435351(US10568876, Example 112 | methyl 3-(2-(2-phenylace...)
Affinity DataIC50:  2.93E+3nM. Assay description: DGAT2 activity was determined by measuring the amount of enzymatic product triolein (1,2,3-Tri(cis-9-octadecenoyl)glycerol) using the membrane prep m...
Ligand InfoPC cidPC sid
In DepthDetails US Patent