BDBM435388 US10584135, Example 219
SMILES Cn1c(SCCCN2C[C@H]3CCN([C@H]3C2)c2ccc(cc2)C(F)(F)F)nnc1C1CCC(O)CC1
InChI Key InChIKey=YHKSIIGCRXQDQA-CCMYNQISSA-N
Data  2 KI
  Tab Delimited (TSV)   2D SDfile   Computed 3D by Vconf -m prep SDfile
Find this compound or compounds like it in BindingDB:
Activity Spreadsheet -- Enzyme Inhibition Constant Data from BindingDB
Found 2 hits for monomerid = 435388
TargetD(3) dopamine receptor(Homo sapiens (Human))
Indivior
US Patent
LigandPNGBDBM435388(US10584135, Example 219)
Affinity DataKi:  2.14nM. Assay description: [3H]-Spiperone Binding Assay at hD3 and hD4 recombinant receptors CHO cells transiently transfected with human dopamine type 3 or 4 receptors (CHO-hD...
Ligand InfoPC cidPC sid
In DepthDetails US Patent
TargetD(2) dopamine receptor(Homo sapiens (Human))
Indivior
US Patent
LigandPNGBDBM435388(US10584135, Example 219)
Affinity DataKi:  676nM. Assay description: CHO cells stably expressing human dopamine receptor type 2, long variant (hD2L), coupled to Gα16 protein (CHO-Gα16-hD2L) were seeded into b...
Ligand InfoPC cidPC sid
In DepthDetails US Patent