BDBM435393 US10570116, Compound C4
SMILES C[C@H](CC(=O)N1CCC(CC1)C(=O)c1cnn(c1)C(C)C)Cc1nc2ccccc2c(=O)[nH]1
InChI Key InChIKey=FUQQJIVTKMJOTI-KRWDZBQOSA-N
Data  3 IC50
  Tab Delimited (TSV)   2D SDfile   Computed 3D by Vconf -m prep SDfile
Find this compound or compounds like it in BindingDB:
Activity Spreadsheet -- Enzyme Inhibition Constant Data from BindingDB
Found 3 hits for monomerid = 435393
TargetPoly [ADP-ribose] polymerase 1(Homo sapiens (Human))
Merck Patent
US Patent
LigandPNGBDBM435393(US10570116, Compound C4)
Affinity DataIC50:  1.90E+3nM. Assay description: PARP-1: The autoparsylation assay is performed as 384-well HTRF® (Cisbio, Codolet, France) assay format in Greiner low volume nb 384-well microtiter ...
Ligand InfoPC cidPC sid
In DepthDetails US Patent
TargetPoly [ADP-ribose] polymerase tankyrase-2(Homo sapiens (Human))
Merck Patent
US Patent
LigandPNGBDBM435393(US10570116, Compound C4)
Affinity DataIC50:  0.450nM. Assay description: TNKS 1 and 2: The activity ELISA is performed in 384 well Glutathione coated microtiter plates (Express capture Glutathione coated plate, Biocat, Hei...
Ligand InfoPC cidPC sid
In DepthDetails US Patent
TargetPoly [ADP-ribose] polymerase tankyrase-1(Homo sapiens (Human))
Merck Patent
US Patent
LigandPNGBDBM435393(US10570116, Compound C4)
Affinity DataIC50:  0.840nM. Assay description: TNKS 1 and 2: The activity ELISA is performed in 384 well Glutathione coated microtiter plates (Express capture Glutathione coated plate, Biocat, Hei...
Ligand InfoPC cidPC sid
In DepthDetails US Patent