BDBM435433 US10570116, Compound C41
SMILES Cc1cc(ccc1C(O)=O)C(=O)C1CCN(CC1)C(=O)CC(C)(C)Cc1nc2c(C)cccc2c(=O)[nH]1
InChI Key InChIKey=ZMDXCCGWVIFDMF-UHFFFAOYSA-N
Data  3 IC50
  Tab Delimited (TSV)   2D SDfile   Computed 3D by Vconf -m prep SDfile
Find this compound or compounds like it in BindingDB:
Activity Spreadsheet -- Enzyme Inhibition Constant Data from BindingDB
Found 3 hits for monomerid = 435433
TargetPoly [ADP-ribose] polymerase 1(Homo sapiens (Human))
Merck Patent
US Patent
LigandPNGBDBM435433(US10570116, Compound C41)
Affinity DataIC50:  3.50E+3nM. Assay description: PARP-1: The autoparsylation assay is performed as 384-well HTRF® (Cisbio, Codolet, France) assay format in Greiner low volume nb 384-well microtiter ...
Ligand InfoPC cidPC sid
In DepthDetails US Patent
TargetPoly [ADP-ribose] polymerase tankyrase-2(Homo sapiens (Human))
Merck Patent
US Patent
LigandPNGBDBM435433(US10570116, Compound C41)
Affinity DataIC50:  0.880nM. Assay description: TNKS 1 and 2: The activity ELISA is performed in 384 well Glutathione coated microtiter plates (Express capture Glutathione coated plate, Biocat, Hei...
Ligand InfoPC cidPC sid
In DepthDetails US Patent
TargetPoly [ADP-ribose] polymerase tankyrase-1(Homo sapiens (Human))
Merck Patent
US Patent
LigandPNGBDBM435433(US10570116, Compound C41)
Affinity DataIC50:  0.590nM. Assay description: TNKS 1 and 2: The activity ELISA is performed in 384 well Glutathione coated microtiter plates (Express capture Glutathione coated plate, Biocat, Hei...
Ligand InfoPC cidPC sid
In DepthDetails US Patent