BDBM435438 US10570116, Compound C46
SMILES C[C@@H](CC(=O)N1CCC(CC1)C(=O)c1cccc(c1)C(O)=O)Cc1nc2c(C)cc(F)cc2c(=O)[nH]1
InChI Key InChIKey=MKFFPXHRRSVHGY-OAHLLOKOSA-N
Data  2 IC50
  Tab Delimited (TSV)   2D SDfile   Computed 3D by Vconf -m prep SDfile
Find this compound or compounds like it in BindingDB:
Activity Spreadsheet -- Enzyme Inhibition Constant Data from BindingDB
Found 2 hits for monomerid = 435438
TargetPoly [ADP-ribose] polymerase tankyrase-2(Homo sapiens (Human))
Merck Patent
US Patent
LigandPNGBDBM435438(US10570116, Compound C46)
Affinity DataIC50:  2.80nM. Assay description: TNKS 1 and 2: The activity ELISA is performed in 384 well Glutathione coated microtiter plates (Express capture Glutathione coated plate, Biocat, Hei...
Ligand InfoPC cidPC sid
In DepthDetails US Patent
TargetPoly [ADP-ribose] polymerase tankyrase-1(Homo sapiens (Human))
Merck Patent
US Patent
LigandPNGBDBM435438(US10570116, Compound C46)
Affinity DataIC50:  8.20nM. Assay description: TNKS 1 and 2: The activity ELISA is performed in 384 well Glutathione coated microtiter plates (Express capture Glutathione coated plate, Biocat, Hei...
Ligand InfoPC cidPC sid
In DepthDetails US Patent