BDBM435450 US10570118, Example 5
SMILES NC(=O)c1cccc(c1)-c1cccc(c1CO)-n1c(cc2cc(ccc2c1=O)C1CC1)C1CN(C1)C(=O)C=C
InChI Key InChIKey=DEDUACXHNRDBJS-UHFFFAOYSA-N
Data  1 IC50
  Tab Delimited (TSV)   2D SDfile   Computed 3D by Vconf -m prep SDfile
Find this compound or compounds like it in BindingDB:
Activity Spreadsheet -- Enzyme Inhibition Constant Data from BindingDB
Found 1 hit for monomerid = 435450
TargetTyrosine-protein kinase BTK(Homo sapiens (Human))
Boehringer Ingelheim International
US Patent
LigandPNGBDBM435450(US10570118, Example 5)
Affinity DataIC50:  5.20nM. Assay description: A Lanthscreen Eu Kinase Binding assay (Life Technologies) was performed to quantitate the ability of test compounds to bind to BTK. The assay is base...
Ligand InfoPC cidPC sid
In DepthDetails US Patent