BDBM435479 US10570118, Example 33
SMILES CNc1cc(ccn1)-c1cccc(c1CO)-n1c(CC2CN(C2)C(=O)C=C)cc2cc(ccc2c1=O)C1CC1
InChI Key InChIKey=NGMWCBWSRGPKEU-UHFFFAOYSA-N
Data  1 IC50
  Tab Delimited (TSV)   2D SDfile   Computed 3D by Vconf -m prep SDfile
Find this compound or compounds like it in BindingDB:
Activity Spreadsheet -- Enzyme Inhibition Constant Data from BindingDB
Found 1 hit for monomerid = 435479
TargetTyrosine-protein kinase BTK(Homo sapiens (Human))
Boehringer Ingelheim International
US Patent
LigandPNGBDBM435479(US10570118, Example 33)
Affinity DataIC50:  510nM. Assay description: A Lanthscreen Eu Kinase Binding assay (Life Technologies) was performed to quantitate the ability of test compounds to bind to BTK. The assay is base...
Ligand InfoPC cidPC sid
In DepthDetails US Patent