BDBM435486 US10570118, Example 40
SMILES Cn1cc(cc1C(N)=O)-c1cccc(c1CO)-n1c(cc2cc(cc(F)c2c1=O)C1CC1)C1CN(C1)C(=O)C=C
InChI Key InChIKey=ILYBTAXMEKDQGZ-UHFFFAOYSA-N
Data  1 IC50
  Tab Delimited (TSV)   2D SDfile   Computed 3D by Vconf -m prep SDfile
Find this compound or compounds like it in BindingDB:
Activity Spreadsheet -- Enzyme Inhibition Constant Data from BindingDB
Found 1 hit for monomerid = 435486
TargetTyrosine-protein kinase BTK(Homo sapiens (Human))
Boehringer Ingelheim International
US Patent
LigandPNGBDBM435486(US10570118, Example 40)
Affinity DataIC50:  0.420nM. Assay description: A Lanthscreen Eu Kinase Binding assay (Life Technologies) was performed to quantitate the ability of test compounds to bind to BTK. The assay is base...
Ligand InfoPC cidPC sid
In DepthDetails US Patent