BDBM435519 US10570123, Example 216
SMILES O=C(Nc1ccccc1-c1nc(Nc2ccc3nncc3c2)c2ccccc2n1)c1ccoc1
InChI Key
Data  1 IC50
  Tab Delimited (TSV)   2D SDfile   Computed 3D by Vconf -m prep SDfile
Find this compound or compounds like it in BindingDB:
Activity Spreadsheet -- Enzyme Inhibition Constant Data from BindingDB
Found 1 hit for monomerid = 435519
TargetRho-associated protein kinase 2(Homo sapiens (Human))
Surface Logix
US Patent
LigandPNGBDBM435519(US10570123, Example 216)
Affinity DataIC50: >1.00E+5nM. Assay description: ROCK-II inhibitory activity can be measured using the ROCK-II Assay Kit (Molecular Devices, inc.; Sunnyvale, Calif.).
Ligand InfoPC cidPC sid
In DepthDetails US Patent