BDBM435772 5-[3-Chloro-2-(trifluoromethoxy)phenyl]-1,3-dihydrobenzimidazol-2-one;::US10611730, Example 29
SMILES FC(F)(F)Oc1c(Cl)cccc1-c1ccc2[nH]c(=O)[nH]c2c1
InChI Key InChIKey=WIECVTBCPZKMHD-UHFFFAOYSA-N
Data  1 IC50
  Tab Delimited (TSV)   2D SDfile   Computed 3D by Vconf -m prep SDfile
Find this compound or compounds like it in BindingDB:
Activity Spreadsheet -- Enzyme Inhibition Constant Data from BindingDB
Found 1 hit for monomerid = 435772
TargetVoltage-dependent calcium channel gamma-8 subunit(Homo sapiens (Human))
Janssen Pharmaceutica
US Patent
LigandPNGBDBM435772(5-[3-Chloro-2-(trifluoromethoxy)phenyl]-1,3-dihydr...)
Affinity DataIC50:  31.6nM. Assay description: This assay was used to test compounds for their ability to inhibit TARP γ8 dependent AMPA receptor activity. The AMPA receptor is a non-selectiv...
Ligand InfoPC cidPC sid
In DepthDetails US Patent