BDBM436051 N-(4-chloro-3-(trifluoromethyl)phenyl)-1-cyano-3-fluoropyrrolidine-3-carboxamide (Prepared According to General Scheme 1)::US10590075, Example 1
SMILES FC(F)(F)c1cc(NC(=O)C2(F)CCN(C2)C#N)ccc1Cl
InChI Key InChIKey=WCODAHHDYHWBAC-UHFFFAOYSA-N
Data  1 IC50
  Tab Delimited (TSV)   2D SDfile   Computed 3D by Vconf -m prep SDfile
Find this compound or compounds like it in BindingDB:
Activity Spreadsheet -- Enzyme Inhibition Constant Data from BindingDB
Found 1 hit for monomerid = 436051
TargetOTU domain-containing protein 7B(Human)
Mission Therapeutics
US Patent
LigandPNGBDBM436051(N-(4-chloro-3-(trifluoromethyl)phenyl)-1-cyano-3-f...)
Affinity DataIC50:  5.50E+3nM. Assay description: Dilution plates were prepared at 21 times the final concentration (2100 μM for a final concentration of 100 μM) in 50% DMSO in a 96-well po...
Ligand InfoPC cidPC sid
In DepthDetails US Patent