BDBM436055 US10611766, Example 8
SMILES CCCOc1ccccc1C(=O)NCc1ccc(cc1)-c1nn(C2CCCC2)c2ncnc(N)c12
InChI Key InChIKey=ONTOVZMNQUSYCR-UHFFFAOYSA-N
Data  3 IC50
  Tab Delimited (TSV)   2D SDfile   Computed 3D by Vconf -m prep SDfile
Find this compound or compounds like it in BindingDB:
Activity Spreadsheet -- Enzyme Inhibition Constant Data from BindingDB
Found 3 hits for monomerid = 436055
TargetTyrosine-protein kinase BTK(Homo sapiens (Human))
Loxo Oncology
US Patent
LigandPNGBDBM436055(US10611766, Example 8)
Affinity DataIC50:  55nM. Assay description: BTKWT binding affinity of each compound tested was determined using a time-resolved fluorescence resonance energy transfer (TR-FRET) methodology. 2.5...
Ligand InfoPC cidPC sid
In DepthDetails US Patent
TargetEpidermal growth factor receptor(Homo sapiens (Human))
Loxo Oncology
US Patent
LigandPNGBDBM436055(US10611766, Example 8)
Affinity DataIC50:  5.50E+3nM. Assay description: EGFR binding affinity was determined using a time-resolved fluorescence resonance energy transfer (TR-FRET) methodology. 2.5 nM Recombinant EGFR, var...
Ligand InfoPC cidPC sid
In DepthDetails US Patent
TargetTyrosine-protein kinase BTK [C481S](Homo sapiens (Human))
Loxo Oncology
US Patent
LigandPNGBDBM436055(US10611766, Example 8)
Affinity DataIC50: <10nM. Assay description: BTKC481S binding affinity of each compound tested was determined using a time-resolved fluorescence resonance energy transfer (TR-FRET) methodology. ...
Ligand InfoPC cidPC sid
In DepthDetails US Patent