BDBM436057 1-cyano-3-fluoro-N-(quinolin-3- yl)pyrrolidine-3-carboxamide::US10590075, Example 4
SMILES FC1(CCN(C1)C#N)C(=O)Nc1cnc2ccccc2c1
InChI Key InChIKey=DPWJFZSUUNMKOT-UHFFFAOYSA-N
Data  1 IC50
  Tab Delimited (TSV)   2D SDfile   Computed 3D by Vconf -m prep SDfile
Find this compound or compounds like it in BindingDB:
Activity Spreadsheet -- Enzyme Inhibition Constant Data from BindingDB
Found 1 hit for monomerid = 436057
TargetOTU domain-containing protein 7B(Human)
Mission Therapeutics
US Patent
LigandPNGBDBM436057(1-cyano-3-fluoro-N-(quinolin-3- yl)pyrrolidine-3-c...)
Affinity DataIC50:  5.50E+3nM. Assay description: Dilution plates were prepared at 21 times the final concentration (2100 μM for a final concentration of 100 μM) in 50% DMSO in a 96-well po...
Ligand InfoPC cidPC sid
In DepthDetails US Patent