BDBM436079 US10611777, Compound 26
SMILES CC[C@H](Nc1ncnc2[nH]cnc12)c1cc2ncc(Cl)n2nc1-c1ccccc1F
InChI Key
Data  1 IC50
  Tab Delimited (TSV)   2D SDfile   Computed 3D by Vconf -m prep SDfile
Find this compound or compounds like it in BindingDB:
Activity Spreadsheet -- Enzyme Inhibition Constant Data from BindingDB
Found 1 hit for monomerid = 436079
TargetPhosphatidylinositol 4,5-bisphosphate 3-kinase catalytic subunit delta isoform(Homo sapiens (Human))
Hutchison Medipharma
US Patent
LigandPNGBDBM436079(US10611777, Compound 26)
Affinity DataIC50:  839nM. Assay description: PI3K kinases including p110α/p85α and p110γ were purchased from Invitrogen, p110δ/p85α and p110β/p85α were from Mi...
Ligand InfoKEGGPC cidPC sid
In DepthDetails US Patent