BDBM436122 US10590105, Example 1014
SMILES Cc1c(COc2cc(OCc3cncc(c3)C#N)c(CN[C@@H](CCCNC(N)=N)C(O)=O)cc2Cl)cccc1-c1ccc2occc2c1
InChI Key InChIKey=HDEITTXSTJRYCM-HKBQPEDESA-N
Data  1 IC50
  Tab Delimited (TSV)   2D SDfile   Computed 3D by Vconf -m prep SDfile
Find this compound or compounds like it in BindingDB:
Activity Spreadsheet -- Enzyme Inhibition Constant Data from BindingDB
Found 1 hit for monomerid = 436122
TargetProgrammed cell death protein 1(Homo sapiens)
Bristol-Meyers Squibb
US Patent
LigandPNGBDBM436122(US10590105, Example 1014)
Affinity DataIC50:  5.00E+3nM. Assay description: The interaction of PD-1 and PD-L1 can be assessed using soluble, purified preparations of the extracellular domains of the two proteins. The PD-1 and...
Ligand InfoKEGGPC cidPC sid
In DepthDetails US Patent