BDBM436123 US10590105, Example 1015
SMILES Cc1c(COc2cc(OCc3cncc(c3)C#N)c(CNC(C)(C)C(O)=O)cc2Cl)cccc1-c1ccc2occc2c1
InChI Key InChIKey=MMOBOONTDRNFRG-UHFFFAOYSA-N
Data  1 IC50
  Tab Delimited (TSV)   2D SDfile   Computed 3D by Vconf -m prep SDfile
Find this compound or compounds like it in BindingDB:
Activity Spreadsheet -- Enzyme Inhibition Constant Data from BindingDB
Found 1 hit for monomerid = 436123
TargetProgrammed cell death protein 1(Homo sapiens)
Bristol-Meyers Squibb
US Patent
LigandPNGBDBM436123(US10590105, Example 1015)
Affinity DataIC50:  80nM. Assay description: The interaction of PD-1 and PD-L1 can be assessed using soluble, purified preparations of the extracellular domains of the two proteins. The PD-1 and...
Ligand InfoPC cidPC sid
In DepthDetails US Patent