BDBM436607 (S)-8-(ethylamino)-1- methyl-4-(4-(3- (methylamino)-1- (thiophen-2- yl)propoxy)benzyl)- 1,2,3,4-tetrahydro- 5H-pyrido[4,3- e][1,4]diazepin-5-one::US10590140, Example 383
SMILES CCNc1cc2N(C)CCN(Cc3ccc(O[C@@H](CCNC)c4cccs4)cc3)C(=O)c2cn1
InChI Key InChIKey=ZQDPPYZTUFYXQP-QHCPKHFHSA-N
Data  3 KI
  Tab Delimited (TSV)   2D SDfile   Computed 3D by Vconf -m prep SDfile
Find this compound or compounds like it in BindingDB:
Activity Spreadsheet -- Enzyme Inhibition Constant Data from BindingDB
Found 3 hits for monomerid = 436607
TargetVoltage-dependent calcium channel subunit alpha-2/delta-1 [25-1103](Homo sapiens (Human))
Esteve Pharmaceuticals
US Patent
LigandPNGBDBM436607((S)-8-(ethylamino)-1- methyl-4-(4-(3- (methylamino...)
Affinity DataKi:  300nM. Assay description: α2δ-1: Binding Assay to Human α2δ-1 Subunit of Cav2.2 Calcium Channel.Human α2δ-1 enriched membranes (2.5 μg) were...
Ligand InfoPC cidPC sid
In DepthDetails US Patent
TargetVoltage-dependent calcium channel subunit alpha-2/delta-1 [25-1103](Homo sapiens (Human))
Esteve Pharmaceuticals
US Patent
LigandPNGBDBM436607((S)-8-(ethylamino)-1- methyl-4-(4-(3- (methylamino...)
Affinity DataKi:  300nM. Assay description: α2δ-1: Binding Assay to Human α2δ-1 Subunit of Cav2.2 Calcium Channel.Human α2δ-1 enriched membranes (2.5 μg) were...
Ligand InfoPC cidPC sid
In DepthDetails US Patent
TargetSodium-dependent noradrenaline transporter(Homo sapiens (Human))
Esteve Pharmaceuticals
US Patent
LigandPNGBDBM436607((S)-8-(ethylamino)-1- methyl-4-(4-(3- (methylamino...)
Affinity DataKi:  300nM. Assay description: NET: Human norepinephrine transporter (NET) enriched membranes (5 μg) were incubated with 5 nM of radiolabeled [3H]-Nisoxetin in assay buffer co...
Ligand InfoPC cidPC sid
In DepthDetails US Patent