BDBM437694 US10617706, Example 128
SMILES Oc1ccc(cc1)N1C2NC(=O)N(C(=O)C2=Cc2ccc(cc12)C#N)c1ccc(Cl)cc1
InChI Key InChIKey=CJFNBSYSZRNPOM-UHFFFAOYSA-N
Data  1 IC50
  Tab Delimited (TSV)   2D SDfile   Computed 3D by Vconf -m prep SDfile
Find this compound or compounds like it in BindingDB:
Activity Spreadsheet -- Enzyme Inhibition Constant Data from BindingDB
Found 1 hit for monomerid = 437694
TargetTyrosyl-DNA phosphodiesterase 2(Homo sapiens (Human))
Regents Of The University Of Minnesota
US Patent
LigandPNGBDBM437694(US10617706, Example 128)
Affinity DataIC50:  32.8nM. Assay description: The enzymatic activity of TDP2 was measured with a SUMO hTDP2cat fluorescence-based biochemical assay. To a black 384-well plate, 10 μL of compo...
Ligand InfoPC cidPC sid
In DepthDetails US Patent