BDBM437697 US10617706, Example 131
SMILES NC(=O)c1cccc(c1)N1C(=O)NC2N(c3ccc(O)cc3)c3cc(ccc3C=C2C1=O)C#N
InChI Key InChIKey=NGLYOOARTVJGAQ-UHFFFAOYSA-N
Data  1 IC50
  Tab Delimited (TSV)   2D SDfile   Computed 3D by Vconf -m prep SDfile
Find this compound or compounds like it in BindingDB:
Activity Spreadsheet -- Enzyme Inhibition Constant Data from BindingDB
Found 1 hit for monomerid = 437697
TargetTyrosyl-DNA phosphodiesterase 2(Homo sapiens (Human))
Regents Of The University Of Minnesota
US Patent
LigandPNGBDBM437697(US10617706, Example 131)
Affinity DataIC50:  35nM. Assay description: The enzymatic activity of TDP2 was measured with a SUMO hTDP2cat fluorescence-based biochemical assay. To a black 384-well plate, 10 μL of compo...
Ligand InfoPC cidPC sid
In DepthDetails US Patent