BDBM43770 (3Z)-3-(2-oxidanylidene-2-thiophen-2-yl-ethylidene)-1,4-dihydroquinoxalin-2-one::(3Z)-3-(2-oxo-2-thiophen-2-ylethylidene)-1,4-dihydroquinoxalin-2-one::(3Z)-3-[2-keto-2-(2-thienyl)ethylidene]-1,4-dihydroquinoxalin-2-one::3-[2-oxo-2-(2-thienyl)ethylidene]-3,4-dihydro-2(1H)-quinoxalinone::MLS000705005::SMR000230609::cid_5410433
SMILES O=C(Cc1nc2ccccc2[nH]c1=O)c1cccs1
InChI Key InChIKey=QTHQCKXCYPEECX-UHFFFAOYSA-N
Data  2 EC50
  Tab Delimited (TSV)   2D SDfile   Computed 3D by Vconf -m prep SDfile
Find this compound or compounds like it in BindingDB:
Activity Spreadsheet -- Enzyme Inhibition Constant Data from BindingDB
Found 2 hits for monomerid = 43770
TargetG2/mitotic-specific cyclin-B1(Homo sapiens (Human))
The Scripps Research Institute Molecular Screening Center
Curated by PubChem BioAssay
LigandPNGBDBM43770((3Z)-3-(2-oxidanylidene-2-thiophen-2-yl-ethylidene...)
Affinity DataEC50: >4.98E+4nM. Assay description: Source (MLPCN Center Name): The Scripps Research Institute Molecular Screening Center Center Affiliation: The Scripps Research Institute (TSRI) Assay...
In DepthDetails PCBioAssay
TargetWee1-like protein kinase(Homo sapiens (Human))
The Scripps Research Institute Molecular Screening Center
Curated by PubChem BioAssay
LigandPNGBDBM43770((3Z)-3-(2-oxidanylidene-2-thiophen-2-yl-ethylidene...)
Affinity DataEC50: >4.98E+4nM. Assay description: Source (MLPCN Center Name): The Scripps Research Institute Molecular Screening Center Center Affiliation: The Scripps Research Institute (TSRI) Assay...
In DepthDetails PCBioAssay