BDBM437726 US10597382, Example 6
SMILES CC(C)Oc1ccc2CN(C(=O)c2c1)c1cccc(n1)-c1nnnn1[C@H](C)CO
InChI Key InChIKey=LTDLZWUKOUDJAH-CYBMUJFWSA-N
Data  1 IC50
  Tab Delimited (TSV)   2D SDfile   Computed 3D by Vconf -m prep SDfile
Find this compound or compounds like it in BindingDB:
Activity Spreadsheet -- Enzyme Inhibition Constant Data from BindingDB
Found 1 hit for monomerid = 437726
TargetMitogen-activated protein kinase kinase kinase 5(Homo sapiens (Human))
Enanta Pharmaceuticals
US Patent
LigandPNGBDBM437726(US10597382, Example 6)
Affinity DataIC50:  5.5nM. Assay description: ASK1 kinase was from Thermofisher (Catalogue # PV4011), ATP was from Sigma (Catalogue # A7699), HTRF KinEASE Assay System was obtained from Cisbio (B...
Ligand InfoPC cidPC sid
In DepthDetails US Patent