BDBM437770 US10597382, Example 13
SMILES CC(C)n1nnnc1-c1cccc(n1)N1Cc2ccc(cc2C1=O)-c1cccnc1
InChI Key InChIKey=ZIMGHATYGVZIDZ-UHFFFAOYSA-N
Data  1 IC50
  Tab Delimited (TSV)   2D SDfile   Computed 3D by Vconf -m prep SDfile
Find this compound or compounds like it in BindingDB:
Activity Spreadsheet -- Enzyme Inhibition Constant Data from BindingDB
Found 1 hit for monomerid = 437770
TargetMitogen-activated protein kinase kinase kinase 5(Homo sapiens (Human))
Enanta Pharmaceuticals
US Patent
LigandPNGBDBM437770(US10597382, Example 13)
Affinity DataIC50:  5.5nM. Assay description: ASK1 kinase was from Thermofisher (Catalogue # PV4011), ATP was from Sigma (Catalogue # A7699), HTRF KinEASE Assay System was obtained from Cisbio (B...
Ligand InfoPC cidPC sid
In DepthDetails US Patent