BDBM43787 1-[(4-ethyl-5-methyl-thiophen-3-yl)carbonylamino]-3-(oxolan-2-ylmethyl)thiourea::1-[(4-ethyl-5-methyl-thiophene-3-carbonyl)amino]-3-(tetrahydrofurfuryl)thiourea::1-[(4-ethyl-5-methylthiophene-3-carbonyl)amino]-3-(oxolan-2-ylmethyl)thiourea::1-[[(4-ethyl-5-methyl-3-thiophenyl)-oxomethyl]amino]-3-(2-oxolanylmethyl)thiourea::MLS-0231795.0001::cid_4607710
SMILES CCc1c(C)scc1C(=O)NNC(=S)NCC1CCCO1
InChI Key InChIKey=DLQDZSLVCDWDJQ-UHFFFAOYSA-N
Data  1 IC50  3 EC50
  Tab Delimited (TSV)   2D SDfile   Computed 3D by Vconf -m prep SDfile
Find this compound or compounds like it in BindingDB:
Activity Spreadsheet -- Enzyme Inhibition Constant Data from BindingDB
Found 4 hits for monomerid = 43787
TargetAlkaline phosphatase, tissue-nonspecific isozyme(Homo sapiens (Human))
Burnham Center For Chemical Genomics
Curated by PubChem BioAssay
LigandPNGBDBM43787(1-[(4-ethyl-5-methyl-thiophen-3-yl)carbonylamino]-...)
Affinity DataEC50:  1.86E+4nM. Assay description: Data Source: Sanford-Burnham Center for Chemical Genomics (SBCCG) Source Affiliation: Sanford-Burnham Medical Research Institute (SBMRI, San Diego, C...
In DepthDetails PCBioAssay
TargetAlkaline phosphatase, tissue-nonspecific isozyme(Homo sapiens (Human))
Burnham Center For Chemical Genomics
Curated by PubChem BioAssay
LigandPNGBDBM43787(1-[(4-ethyl-5-methyl-thiophen-3-yl)carbonylamino]-...)
Affinity DataEC50:  3.69E+4nM. Assay description: Data Source: Sanford-Burnham Center for Chemical Genomics (SBCCG) Source Affiliation: Sanford-Burnham Medical Research Institute (SBMRI, San Diego, C...
In DepthDetails PCBioAssay
TargetAlkaline phosphatase, tissue-nonspecific isozyme(Homo sapiens (Human))
Burnham Center For Chemical Genomics
Curated by PubChem BioAssay
LigandPNGBDBM43787(1-[(4-ethyl-5-methyl-thiophen-3-yl)carbonylamino]-...)
Affinity DataEC50:  1.12E+4nM. Assay description: Data Source: Sanford-Burnham Center for Chemical Genomics (SBCCG) Source Affiliation: Sanford-Burnham Medical Research Institute (SBMRI, San Diego, C...
In DepthDetails PCBioAssay
TargetAlkaline phosphatase, germ cell type(Homo sapiens (Human))
Burnham Center For Chemical Genomics
Curated by PubChem BioAssay
LigandPNGBDBM43787(1-[(4-ethyl-5-methyl-thiophen-3-yl)carbonylamino]-...)
Affinity DataIC50: >1.00E+5nM. Assay description: Data Source: Sanford-Burnham Center for Chemical Genomics (SBCCG) Source Affiliation: Sanford-Burnham Medical Research Institute (SBMRI, San Diego, C...
In DepthDetails PCBioAssay