BDBM438098 US10597399, Compound S30
SMILES CC1CN(Cc2nnc(-c3nccs3)n12)C(=O)c1cc(Cc2cc(C)c(=O)[nH]n2)ccc1F
InChI Key
Data  1 IC50
  Tab Delimited (TSV)   2D SDfile   Computed 3D by Vconf -m prep SDfile
Find this compound or compounds like it in BindingDB:
Activity Spreadsheet -- Enzyme Inhibition Constant Data from BindingDB
Found 1 hit for monomerid = 438098
TargetPoly [ADP-ribose] polymerase 1(Homo sapiens (Human))
Shanghai Institute Of Material Medica, Chinese Academy Of Sciences
US Patent
LigandPNGBDBM438098(US10597399, Compound S30)
Affinity DataIC50: <100nM. Assay description: The HTb-PARP-1 positive clones were obtained using the full-length PARP-1 plasmid, through PCR amplification, enzyme digestion, ligation, and transfo...
Ligand InfoPC cidPC sid
In DepthDetails US Patent