BDBM438256 US10597377, Compound 2-261
SMILES Fc1cc(F)cc(c1)-c1cnc2ccc(cc2c1N1CCC2NCCO[C@@H]2C1)-c1ncc(cc1F)C#N
InChI Key InChIKey=ZISCYRMZJZTBOH-FXDYGKIASA-N
Data  1 EC50
  Tab Delimited (TSV)   2D SDfile   Computed 3D by Vconf -m prep SDfile
Find this compound or compounds like it in BindingDB:
Activity Spreadsheet -- Enzyme Inhibition Constant Data from BindingDB
Found 1 hit for monomerid = 438256
TargetSomatostatin receptor type 2(Homo sapiens (Human))
Crinetics Pharmaceuticals
US Patent
LigandPNGBDBM438256(US10597377, Compound 2-261)
Affinity DataEC50:  55nM. Assay description: Four days prior to the assay, 5,000 Chinese hamster ovary cells (CHO-K1, ATCC # CCL-61) stably expressing the human SSTR2 are plated in each well of ...
Ligand InfoPC cidPC sid
In DepthDetails US Patent