BDBM438339 US10618897, Example 160
SMILES FC[C@@H]1CC(F)(F)CN1C(=O)CN1C(=O)C2(CCN(CC2)C(=O)c2ccc3[nH]ncc3c2)c2c1cccc2Br
InChI Key
Data  1 IC50
  Tab Delimited (TSV)   2D SDfile   Computed 3D by Vconf -m prep SDfile
Find this compound or compounds like it in BindingDB:
Activity Spreadsheet -- Enzyme Inhibition Constant Data from BindingDB
Found 1 hit for monomerid = 438339
TargetEpithelial discoidin domain-containing receptor 1(Homo sapiens (Human))
Hoffmann-La Roche
US Patent
LigandPNGBDBM438339(US10618897, Example 160)
Affinity DataIC50:  15.8nM. Assay description: An in vitro binding competition assay was performed to evaluate the effect of the compounds of present invention on DDR1 protein.Binding Competition ...
Ligand InfoPC cidPC sid
In DepthDetails US Patent