BDBM438379 (R)-6-(6-chloropyrazolo[1,5-a]pyrimidin-3-yl)-N-(2-fluoro-3-hydroxy-3-methylbutyl)-4-((1-hydroxy-2-methylpropan-2-yl)amino)nicotinamide::US10618903, Example 7
SMILES CC(C)(CO)Nc1cc(ncc1C(=O)NC[C@@H](F)C(C)(C)O)-c1cnn2cc(Cl)cnc12
InChI Key InChIKey=JKKNNONTQZHBFC-QGZVFWFLSA-N
Data  1 IC50
  Tab Delimited (TSV)   2D SDfile   Computed 3D by Vconf -m prep SDfile
Find this compound or compounds like it in BindingDB:
Activity Spreadsheet -- Enzyme Inhibition Constant Data from BindingDB
Found 1 hit for monomerid = 438379
TargetInterleukin-1 receptor-associated kinase 4(Homo sapiens (Human))
Bristol-Myers Squibb
US Patent
LigandPNGBDBM438379((R)-6-(6-chloropyrazolo[1,5-a]pyrimidin-3-yl)-N-(2...)
Affinity DataIC50:  2nM. Assay description: The assays were performed in U-bottom 384-well plates. The final assay volume was 30 μL prepared from 15 μL additions of enzyme and substra...
Ligand InfoPC cidPC sid
In DepthDetails US Patent