BDBM43843 (E)-3-(1-benzyl-3-pyridin-3-ylpyrazol-4-yl)prop-2-enoic acid::(E)-3-[1-(phenylmethyl)-3-(3-pyridinyl)-4-pyrazolyl]-2-propenoic acid::(E)-3-[1-(phenylmethyl)-3-pyridin-3-yl-pyrazol-4-yl]prop-2-enoic acid::(E)-3-[1-benzyl-3-(3-pyridyl)pyrazol-4-yl]acrylic acid::Acid, 25::MLS000773816::SMR000364660::cid_5940518
SMILES OC(=O)\C=C\c1cn(Cc2ccccc2)nc1-c1cccnc1
InChI Key InChIKey=OXIKLRTYAYRAOE-CMDGGOBGSA-N
Data  1 IC50
  Tab Delimited (TSV)   2D SDfile   Computed 3D by Vconf -m prep SDfile
Find this compound or compounds like it in BindingDB:
Activity Spreadsheet -- Enzyme Inhibition Constant Data from BindingDB
Found 1 hit for monomerid = 43843
TargetDNA repair protein RAD51 homolog 1(Homo sapiens (Human))
Pcmd
Curated by PubChem BioAssay
LigandPNGBDBM43843((E)-3-(1-benzyl-3-pyridin-3-ylpyrazol-4-yl)prop-2-...)
Affinity DataIC50:  5.30E+4nM. Assay description: Project Title: A screen for modulators of human Rad51, a key DNA repair protein Application Number: MH084119 Assay Submitter: Dr. Alex Mazin Submitte...
In DepthDetails PCBioAssay