BDBM438733 N-{1-[(4S)-7-(3,5-dimethylisoxazol-4-yl)- 4-pyridin-2-yl-4,5-dihydroimidazo[1,5,4- de][1,4]benzoxazin-2-yl]piperidin-4- yl}cyclopropanecarboxamide::US10618910, Example 12
SMILES Cc1noc(C)c1-c1ccc2nc(N3CCC(CC3)NC(=O)C3CC3)n3[C@H](COc1c23)c1ccccn1
InChI Key InChIKey=DUPQOQJOCVRTBS-HSZRJFAPSA-N
Data  2 IC50
  Tab Delimited (TSV)   2D SDfile   Computed 3D by Vconf -m prep SDfile
Find this compound or compounds like it in BindingDB:
Activity Spreadsheet -- Enzyme Inhibition Constant Data from BindingDB
Found 2 hits for monomerid = 438733
TargetBromodomain-containing protein 4 [342-460](Homo sapiens (Human))
Incyte
US Patent
LigandPNGBDBM438733(N-{1-[(4S)-7-(3,5-dimethylisoxazol-4-yl)- 4-pyridi...)
Affinity DataIC50: <25nM. Assay description: BRD4-BD1 and BRD4-BD2 assays were conducted in white 384-well polystyrene plate in a final volume of 20 μL for BD1 and 40 μL for BD2. Inhib...
Ligand InfoPC cidPC sid
In DepthDetails US Patent
TargetBromodomain-containing protein 4 [49-170](Homo sapiens (Human))
Incyte
US Patent
LigandPNGBDBM438733(N-{1-[(4S)-7-(3,5-dimethylisoxazol-4-yl)- 4-pyridi...)
Affinity DataIC50: <25nM. Assay description: BRD4-BD1 and BRD4-BD2 assays were conducted in white 384-well polystyrene plate in a final volume of 20 μL for BD1 and 40 μL for BD2. Inhib...
Ligand InfoPC cidPC sid
In DepthDetails US Patent