BDBM438758 US10618914, Compound UPCDC10305::US11111253, Compound UPCDC10305
SMILES COc1ccc(cc1)C1=Nn2c(SC1CC(C)C)nnc2-c1[nH]nc2CCCc12
InChI Key
Data  3 IC50
  Tab Delimited (TSV)   2D SDfile   Computed 3D by Vconf -m prep SDfile
Find this compound or compounds like it in BindingDB:
Activity Spreadsheet -- Enzyme Inhibition Constant Data from BindingDB
Found 3 hits for monomerid = 438758
TargetSignal transducer and activator of transcription 3(Homo sapiens (Human))
University Of Pittsburgh
US Patent
LigandPNGBDBM438758(US10618914, Compound UPCDC10305 | US11111253, Comp...)
Affinity DataIC50:  5.14E+3nM. Assay description: Compound samples (in 3-5 mg quantities) were evaluated in a variety of assays. All compound submissions were fully characterized (1H, 13C, IR, HRMS),...
Ligand InfoPC cidPC sid
In DepthDetails US Patent
TargetSignal transducer and activator of transcription 3(Homo sapiens (Human))
University Of Pittsburgh
US Patent
LigandPNGBDBM438758(US10618914, Compound UPCDC10305 | US11111253, Comp...)
Affinity DataIC50:  5.10E+3nM. Assay description: Compound samples (in 3-5 mg quantities) were evaluated in a variety of assays. All compound submissions were fully characterized (1H, 13C, IR, FIRMS)...
Ligand InfoPC cidPC sid
In DepthDetails US Patent
TargetSignal transducer and activator of transcription 3(Homo sapiens (Human))
University Of Pittsburgh
US Patent
LigandPNGBDBM438758(US10618914, Compound UPCDC10305 | US11111253, Comp...)
Affinity DataIC50:  5.14E+3nM. Assay description: Compound samples (in 3-5 mg quantities) were evaluated in a variety of assays. All compound submissions were fully characterized (1H, 13C, IR, FIRMS)...
Ligand InfoPC cidPC sid
In DepthDetails US Patent