BDBM43879 2-chloranyl-N-[[4-(3-nitrophenyl)-1,3-thiazol-2-yl]carbamothioyl]benzamide::2-chloro-N-({[4-(3-nitrophenyl)-1,3-thiazol-2-yl]amino}carbonothioyl)benzamide::2-chloro-N-[[4-(3-nitrophenyl)-1,3-thiazol-2-yl]carbamothioyl]benzamide::2-chloro-N-[[4-(3-nitrophenyl)thiazol-2-yl]thiocarbamoyl]benzamide::2-chloro-N-[[[4-(3-nitrophenyl)-2-thiazolyl]amino]-sulfanylidenemethyl]benzamide::MLS000681440::SMR000269115::cid_2282402
SMILES [O-][N+](=O)c1cccc(c1)-c1csc(NC(=S)NC(=O)c2ccccc2Cl)n1
InChI Key InChIKey=BLBBVELUXDOMAZ-UHFFFAOYSA-N
Data  6 EC50
  Tab Delimited (TSV)   2D SDfile   Computed 3D by Vconf -m prep SDfile
Find this compound or compounds like it in BindingDB:
Activity Spreadsheet -- Enzyme Inhibition Constant Data from BindingDB
Found 6 hits for monomerid = 43879
TargetSolute carrier family 12 member 5(Homo sapiens (Human))
Vanderbilt Screening Center For Gpcrs, Ion Channels And Transporters
Curated by PubChem BioAssay
LigandPNGBDBM43879(2-chloranyl-N-[[4-(3-nitrophenyl)-1,3-thiazol-2-yl...)
Affinity DataEC50:  6.81E+3nM. Assay description: Vanderbilt Screening Center for GPCRs, Ion Channels and Transporters Assay Provider: Eric Delpire Assay Provider Affliation: Vanderbilt University Gr...
In DepthDetails PCBioAssay
TargetSolute carrier family 12 member 5(Homo sapiens (Human))
Vanderbilt Screening Center For Gpcrs, Ion Channels And Transporters
Curated by PubChem BioAssay
LigandPNGBDBM43879(2-chloranyl-N-[[4-(3-nitrophenyl)-1,3-thiazol-2-yl...)
Affinity DataEC50:  1.39E+5nM. Assay description: Vanderbilt Screening Center for GPCRs, Ion Channels and Transporters Assay Provider: Eric Delpire Assay Provider Affliation: Vanderbilt University Gr...
In DepthDetails PCBioAssay
TargetSolute carrier family 12 member 5(Homo sapiens (Human))
Vanderbilt Screening Center For Gpcrs, Ion Channels And Transporters
Curated by PubChem BioAssay
LigandPNGBDBM43879(2-chloranyl-N-[[4-(3-nitrophenyl)-1,3-thiazol-2-yl...)
Affinity DataEC50:  2.44E+5nM. Assay description: Vanderbilt Screening Center for GPCRs, Ion Channels and Transporters Assay Provider: Eric Delpire Assay Provider Affliation: Vanderbilt University Gr...
In DepthDetails PCBioAssay
TargetSolute carrier family 12 member 5(Homo sapiens (Human))
Vanderbilt Screening Center For Gpcrs, Ion Channels And Transporters
Curated by PubChem BioAssay
LigandPNGBDBM43879(2-chloranyl-N-[[4-(3-nitrophenyl)-1,3-thiazol-2-yl...)
Affinity DataEC50:  7.40E+4nM. Assay description: Vanderbilt Screening Center for GPCRs, Ion Channels and Transporters Assay Provider: Eric Delpire Assay Provider Affliation: Vanderbilt University Gr...
In DepthDetails PCBioAssay
TargetSolute carrier family 12 member 5(Homo sapiens (Human))
Vanderbilt Screening Center For Gpcrs, Ion Channels And Transporters
Curated by PubChem BioAssay
LigandPNGBDBM43879(2-chloranyl-N-[[4-(3-nitrophenyl)-1,3-thiazol-2-yl...)
Affinity DataEC50:  7.48E+3nM. Assay description: Vanderbilt Screening Center for GPCRs, Ion Channels and Transporters Assay Provider: Eric Delpire Assay Provider Affliation: Vanderbilt University Gr...
In DepthDetails PCBioAssay
TargetSolute carrier family 12 member 5(Homo sapiens (Human))
Vanderbilt Screening Center For Gpcrs, Ion Channels And Transporters
Curated by PubChem BioAssay
LigandPNGBDBM43879(2-chloranyl-N-[[4-(3-nitrophenyl)-1,3-thiazol-2-yl...)
Affinity DataEC50:  9.60E+3nM. Assay description: Vanderbilt Screening Center for GPCRs, Ion Channels and Transporters Assay Provider: Eric Delpire Assay Provider Affliation: Vanderbilt University Gr...
In DepthDetails PCBioAssay