BDBM438792 US10618914, Compound 27
SMILES CCC(C)C1Sc2nnc(-c3[nH]nc4CCCc34)n2N=C1c1ccc(OC)cc1
InChI Key
Data  2 IC50
  Tab Delimited (TSV)   2D SDfile   Computed 3D by Vconf -m prep SDfile
Find this compound or compounds like it in BindingDB:
Activity Spreadsheet -- Enzyme Inhibition Constant Data from BindingDB
Found 2 hits for monomerid = 438792
TargetSignal transducer and activator of transcription 1-alpha/beta(Homo sapiens (Human))
University Of Pittsburgh
US Patent
LigandPNGBDBM438792(US10618914, Compound 27)
Affinity DataIC50: >5.00E+4nM. Assay description: Compound samples (in 3-5 mg quantities) were evaluated in a variety of assays. All compound submissions were fully characterized (1H, 13C, IR, HRMS),...
Ligand InfoPC cidPC sid
In DepthDetails US Patent
TargetSignal transducer and activator of transcription 3(Homo sapiens (Human))
University Of Pittsburgh
US Patent
LigandPNGBDBM438792(US10618914, Compound 27)
Affinity DataIC50:  4.10E+3nM. Assay description: Compound samples (in 3-5 mg quantities) were evaluated in a variety of assays. All compound submissions were fully characterized (1H, 13C, IR, HRMS),...
Ligand InfoPC cidPC sid
In DepthDetails US Patent