BDBM438975 US10604489, Compound 136::US11180455, Compound 136
SMILES COC1(C2CCCC1CN(C[C@H]1CCCO1)C2)c1ccnc(c1)C(N)=O
InChI Key InChIKey=HFNVCXRSMYLGNN-RSXKDLDNSA-N
Data  2 KI
  Tab Delimited (TSV)   2D SDfile   Computed 3D by Vconf -m prep SDfile
Find this compound or compounds like it in BindingDB:
Activity Spreadsheet -- Enzyme Inhibition Constant Data from BindingDB
Found 2 hits for monomerid = 438975
TargetMu-type opioid receptor(Homo sapiens (Human))
TBA
US Patent
LigandPNGBDBM438975(US10604489, Compound 136 | US11180455, Compound 13...)
Affinity DataKi: >5nM. Assay description: The Ki (binding affinity) for μ-receptor was determined with a previously described method using a competitive displacement assay (Neumeyer et a...
Ligand InfoPC cidPC sid
In DepthDetails US Patent
TargetMu-type opioid receptor(Homo sapiens (Human))
TBA
US Patent
LigandPNGBDBM438975(US10604489, Compound 136 | US11180455, Compound 13...)
Affinity DataKi: >5nM. Assay description: Membrane protein from CHO (Chinese Hamster Ovarian) cells that stably expressed one type of the cloned human opioid receptor were incubated with 12 d...
Ligand InfoPC cidPC sid
In DepthDetails US Patent