BDBM43898 2-[(5-benzyl-1,3,4-oxadiazol-2-yl)sulfanyl]-N-(5-methyl-1,3-thiazol-2-yl)acetamide::2-[(5-benzyl-1,3,4-oxadiazol-2-yl)thio]-N-(5-methylthiazol-2-yl)acetamide::N-(5-methyl-1,3-thiazol-2-yl)-2-[[5-(phenylmethyl)-1,3,4-oxadiazol-2-yl]sulfanyl]ethanamide::N-(5-methyl-2-thiazolyl)-2-[[5-(phenylmethyl)-1,3,4-oxadiazol-2-yl]thio]acetamide::VU0177735-2-D12::cid_891615
SMILES Cc1cnc(NC(=O)CSc2nnc(Cc3ccccc3)o2)s1
InChI Key InChIKey=ITUMWNDRDFLGQS-UHFFFAOYSA-N
Data  1 IC50
  Tab Delimited (TSV)   2D SDfile   Computed 3D by Vconf -m prep SDfile
Find this compound or compounds like it in BindingDB:
Activity Spreadsheet -- Enzyme Inhibition Constant Data from BindingDB
Found 1 hit for monomerid = 43898
TargetSolute carrier family 12 member 5(Homo sapiens (Human))
Vanderbilt Screening Center For Gpcrs, Ion Channels And Transporters
Curated by PubChem BioAssay
LigandPNGBDBM43898(2-[(5-benzyl-1,3,4-oxadiazol-2-yl)sulfanyl]-N-(5-m...)
Affinity DataIC50:  1.97E+4nM. Assay description: Vanderbilt Screening Center for GPCRs, Ion Channels and Transporters Assay Provider: Eric Delpire Assay Provider Affliation: Vanderbilt University Gr...
In DepthDetails PCBioAssay