BDBM439026 US10604502, Ex # 14
SMILES Cc1cc2n(cc(-c3cncc(N)c3Cl)c2cc1C#N)[C@@H]1C[C@H](O)C1
InChI Key InChIKey=ZQHCJZGVESBCID-BETUJISGSA-N
Data  1 IC50
  Tab Delimited (TSV)   2D SDfile   Computed 3D by Vconf -m prep SDfile
Find this compound or compounds like it in BindingDB:
Activity Spreadsheet -- Enzyme Inhibition Constant Data from BindingDB
Found 1 hit for monomerid = 439026
TargetLysine-specific histone demethylase 1A(Homo sapiens (Human))
Novartis
US Patent
LigandPNGBDBM439026(US10604502, Ex # 14)
Affinity DataIC50:  24nM. Assay description: Representative compounds of the present invention were serially and separately diluted 3-fold in DMSO to obtain a total of twelve concentrations. The...
Ligand InfoPC cidPC sid
In DepthDetails US Patent