BDBM439046 US10604502, Ex # 34
SMILES Cc1cc2n(CCCO)cc(-c3cccc4NC(C)(C)CCc34)c2cc1C#N
InChI Key InChIKey=XLUAHHHWWCIRNP-UHFFFAOYSA-N
Data  1 IC50
  Tab Delimited (TSV)   2D SDfile   Computed 3D by Vconf -m prep SDfile
Find this compound or compounds like it in BindingDB:
Activity Spreadsheet -- Enzyme Inhibition Constant Data from BindingDB
Found 1 hit for monomerid = 439046
TargetLysine-specific histone demethylase 1A(Homo sapiens (Human))
Novartis
US Patent
LigandPNGBDBM439046(US10604502, Ex # 34)
Affinity DataIC50:  4nM. Assay description: Representative compounds of the present invention were serially and separately diluted 3-fold in DMSO to obtain a total of twelve concentrations. The...
Ligand InfoPC cidPC sid
In DepthDetails US Patent