BDBM439082 US10604502, Ex # 70
SMILES CNC(=O)N1CCC(C1)n1cc(-c2cncc(N)c2Cl)c2cc(C#N)c(C)cc12
InChI Key InChIKey=WKKZPCRYYPNUJG-UHFFFAOYSA-N
Data  1 IC50
  Tab Delimited (TSV)   2D SDfile   Computed 3D by Vconf -m prep SDfile
Find this compound or compounds like it in BindingDB:
Activity Spreadsheet -- Enzyme Inhibition Constant Data from BindingDB
Found 1 hit for monomerid = 439082
TargetLysine-specific histone demethylase 1A(Homo sapiens (Human))
Novartis
US Patent
LigandPNGBDBM439082(US10604502, Ex # 70)
Affinity DataIC50:  191nM. Assay description: Representative compounds of the present invention were serially and separately diluted 3-fold in DMSO to obtain a total of twelve concentrations. The...
Ligand InfoPC cidPC sid
In DepthDetails US Patent